{"text_format":"1","workbook":"xlsx","n_sheets":11,"sheets":["Usmernenie","Príklady","Príjmy","Spolu","Doklady","Adr","FP","Cis","Avízo - výnosy","Avízo - vratka","Skratky"],"not_rendered":{"charts":0,"images":0,"macros":0,"external_links":0,"defined_names":11,"comments":3,"pivot_tables":0},"unopened":[],"bounds":{"document_bytes":16777216,"sheet_cells":100000,"rows_first":2000,"rows_last":500,"rows_between":2000,"halvings":0,"cell_chars":16384,"cell_head_chars":4096},"cells_cut":0,"cells_raw":0,"read":"whole","date_system":"1900"}

{"sheet":"Usmernenie","index":0,"n_rows":139,"n_cols":4,"rows_kept":139,"cut":false,"hidden":false,"merged":[[21,2,21,3],[0,2,0,3],[18,2,18,3],[19,2,19,3]]}
["Usmernenie k priebežnému čerpaniu a vyúčtovaniu finančných prostriedkov poskytnutých v roku 2024"]
[]
["ZÁKLADNÉ POKYNY"]
["1. Vložiť údaje do hárkov \"Príjmy\" a \"Doklady\"."]
["2. Skontrolovať hárky \"Doklady\" a \"Spolu\"."]
["3. Po kontrole odoslať elektronickú verziu formuláru na adresu ziadosti.sport@minedu.sk."]
["4. Vyplniť hárok  \"Avízo - vratka\" (len Prijímatelia, ktorí nevyčerpali celú sumu)."]
["5. Vytlačiť hárky \"Spolu\", \"Doklady\", \"Avízo - vratka\"."]
["6. Dopísať do hárku \"Spolu\" dátum a čas odoslania elektronickej verzie formuláru vyúčtovania."]
["7. Podpísať všetky hárky štatutárnym zástupcom/zástupcami. "]
{"$rows_left_out":130}
{"sheet":"Príklady","index":1,"n_rows":76,"n_cols":9,"rows_kept":76,"cut":false,"hidden":false,"merged":[[0,0,0,7],[3,1,3,4],[1,7,1,8],[2,7,2,8],[1,0,1,6]]}
["Príklady vyplnenia formulára"]
["Priebežné čerpanie finančných prostriedkov poskytnutých zo štátneho rozpočtu v oblasti športu v roku 2024",null,null,null,null,null,null,{"$f":"+Doklady!I100","v":"V1"}]
[null,null,null,null,null,null,null,{"$f":"+Doklady!I101","v":"2024-01-25"}]
["Prijímateľ dotácie:","Slovenský zväz skúšobný"]
[]
[]
["Účel úhrady\n(vyberte zo zoznamu, inak automatické vyhodnocovanie nebude fungovať)","Interné číslo účtovného dokladu","Číslo externého (originálneho)\núčtovného dokladu","Dátum skutočnej úhrady účtovného dokladu","Popis úhrady\n(vyberte z rozbaľovacieho zoznamu, alebo zadajte voľný text)","IČO \ndodávateľa\nplnenia","Dodávateľ plnenia","Skutočne uhradená suma\n(eur)","AK"]
["a - kriket - bežné výdavky",null,null,"2024-05-02","Organizovanie podujatia\nNázov podujatia: Svetový pohár v skúškach\nMiesto konania: Brezno\nTermín: 15. - 18.4.2024\nPočet zúčastnených osôb (okrem divákov): 20\n"]
["a - kriket - bežné výdavky","123/2024","CP14-110","2024-05-03","počet odpracovaných hodín spolu: 100\nhrubé mzdy vyplatené osobám v súvislosti s podujatím vrátane odvodov zamestnávateľa spolu (dohody, zmluvy, faktúry, a pod.) v eur",null,"osoba 1 - osoba 20",400,3]
["a - kriket - bežné výdavky","124/2024","DF 24","2024-05-04","náklady na ubytovanie 10 športovcov + 1 tréner",null,"Chata Breznovčan",null,3]
{"$rows_left_out":67}
{"sheet":"Príjmy","index":2,"n_rows":61,"n_cols":7,"rows_kept":61,"cut":false,"hidden":false,"merged":[[2,1,2,3],[16,0,16,3],[0,0,0,1]]}
["Aktualizovaná suma prostriedkov poskytnutých ministerstvom k  dátumu",null,"2024-01-31",null,null,null,"2024-01-31"]
[null,null,null,null,null,null,"2024-02-29"]
["Prijímateľ",{"$f":"INDEX(Adr!B:B,Doklady!B102+1)","v":"Slovenský krasokorčuliarsky zväz"},null,null,null,null,"2024-03-31"]
["IČO:",{"$f":"RIGHT(\"0000\"&INDEX(Adr!A:A,Doklady!B102+1),8)","v":"31805540"},null,null,null,null,"2024-04-30"]
["Sídlo:",{"$f":"INDEX(Adr!D:D,Doklady!B102+1)&\", \"&INDEX(Adr!E:E,Doklady!B102+1)","v":"Záhradnícka 752/95, Bratislava"},null,null,null,null,"2024-05-31"]
[null,null,null,null,null,null,"2024-06-30"]
[null,null,null,null,null,null,"2024-07-31"]
[null,null,null,null,null,null,"2024-08-31"]
["PPG","PPG","Poskytnuté prostriedky",null,null,null,"2024-09-30"]
["026 01","Šport pre všetkých, školský a univerzitný šport",{"$f":"+Spolu!C10","v":0},null,null,null,"2024-10-31"]
{"$rows_left_out":52}
{"sheet":"Spolu","index":3,"n_rows":141,"n_cols":21,"rows_kept":141,"cut":false,"hidden":false,"merged":[[139,3,139,8],[31,1,31,7],[33,1,33,7],[32,1,32,7],[30,1,30,7],[29,1,29,7],[26,1,26,7],[27,1,27,7],[15,1,15,7],[17,1,17,7],[18,1,18,7],[19,1,19,7],[20,1,20,7],[21,1,21,7],[140,3,140,8],[9,4,9,5],[49,0,49,8],[28,1,28,7],[0,0,0,8],[2,2,2,5],[8,4,8,5],[11,4,11,5],[10,4,10,5],[13,4,13,5],[12,4,12,5],[16,1,16,7],[23,1,23,7],[24,1,24,7],[22,1,22,7],[25,1,25,7]]}
["Priebežné čerpanie a vyúčtovanie finančných prostriedkov poskytnutých zo štátneho rozpočtu v oblasti športu v roku 2024"]
[]
[null,"Prijímateľ dotácie:",{"$f":"INDEX(Adr!B2:B111,Doklady!B102)","v":"Slovenský krasokorčuliarsky zväz"},null,null,null,null,null,{"$f":"Doklady!I100","v":"V1"}]
[null,"IČO:",{"$f":"INDEX(Adr!A2:A154,Doklady!B102)","v":"31805540"},null,null,null,null,null,{"$f":"Doklady!I101","v":"2024-01-25"}]
[null,"Právna forma:",{"$f":"INDEX(Adr!C2:C154,Doklady!B102)","v":"občianske združenie"}]
[null,"Sídlo:",{"$f":"INDEX(Adr!D2:D154,Doklady!B102)&\", \"&INDEX(Adr!E2:E154,Doklady!B102)&\", \"&INDEX(Adr!F2:F154,Doklady!B102)","v":"Záhradnícka 752/95, Bratislava, 821 08"}]
[]
[]
["PPG","Podprogram","Poskytnuté\n(eur)","Vyúčtované\n(eur)","Povinnosť\nvrátiť\n(eur)"]
["026 01","Šport pre všetkých, školský a univerzitný šport",{"$f":"SUMIF(FP!J:J,Doklady!$B$1&A10,FP!D:D)","v":0},{"$f":"C10-E10","v":0},{"$f":"SUMIF(K:K,A10,I:I)","v":0},null,null,null,null,null,null,"AAA"]
{"$rows_left_out":132}
{"sheet":"Doklady","index":4,"n_rows":157,"n_cols":14,"rows_kept":157,"cut":false,"hidden":false,"merged":[[99,0,99,7],[100,8,100,9],[99,8,99,9],[100,0,100,7],[104,0,104,9]]}
[{"$f":"IF(ROW()<=B$3,INDEX(FP!F:F,B$2+ROW()-1)&\" - \"&INDEX(FP!C:C,B$2+ROW()-1),\"\")","v":"a - krasokorčuľovanie - bežné transfery"},{"$f":"INDEX(Adr!A:A,B102+1)","v":"31805540"},{"$f":"IF(ROW()<=B$3,INDEX(FP!E:E,B$2+ROW()-1),\"\")","v":0},{"$f":"IF(ROW()<=B$3,INDEX(FP!F:F,B$2+ROW()-1),\"\")","v":"a"},null,{"$f":"IF(ROW()<=B$3,INDEX(FP!G:G,B$2+ROW()-1),\"\")","v":"026 02"},null,{"$f":"IF(ROW()<=B$3,INDEX(FP!C:C,B$2+ROW()-1),\"\")","v":"krasokorčuľovanie - bežné transfery"},{"$f":"IF(ROW()<=B$3,SUMIF(A$107:A$10042,A1,I$107:I$10042),\"\")","v":31678.950000000008},{"$f":"IF(ROW()<=B$3,SUMIFS(I$103:I$50042,A$103:A$50042,K1,J$103:J$50042,L1),\"\")","v":0},{"$f":"$A1","v":"a - krasokorčuľovanie - bežné transfery"},99]
[{"$f":"IF(ROW()<=B$3,INDEX(FP!F:F,B$2+ROW()-1)&\" - \"&INDEX(FP!C:C,B$2+ROW()-1),\"\")","v":""},{"$f":"MATCH(B1,FP!A:A,0)","v":54},{"$f":"IF(ROW()<=B$3,INDEX(FP!E:E,B$2+ROW()-1),\"\")","v":""},{"$f":"IF(ROW()<=B$3,INDEX(FP!F:F,B$2+ROW()-1),\"\")","v":""},null,{"$f":"IF(ROW()<=B$3,INDEX(FP!G:G,B$2+ROW()-1),\"\")","v":""},null,{"$f":"IF(ROW()<=B$3,INDEX(FP!C:C,B$2+ROW()-1),\"\")","v":""},"","",{"$f":"$A2","v":""},99,"AAA","HHH"]
[{"$f":"IF(ROW()<=B$3,INDEX(FP!F:F,B$2+ROW()-1)&\" - \"&INDEX(FP!C:C,B$2+ROW()-1),\"\")","v":""},{"$f":"COUNTIF(FP!A:A,Doklady!B1)","v":1},{"$f":"IF(ROW()<=B$3,INDEX(FP!E:E,B$2+ROW()-1),\"\")","v":""},{"$f":"IF(ROW()<=B$3,INDEX(FP!F:F,B$2+ROW()-1),\"\")","v":""},null,{"$f":"IF(ROW()<=B$3,INDEX(FP!G:G,B$2+ROW()-1),\"\")","v":""},null,{"$f":"IF(ROW()<=B$3,INDEX(FP!C:C,B$2+ROW()-1),\"\")","v":""},"","",{"$f":"$A3","v":""},99,{"$f":"$A2","v":""},99]
[{"$f":"IF(ROW()<=B$3,INDEX(FP!F:F,B$2+ROW()-1)&\" - \"&INDEX(FP!C:C,B$2+ROW()-1),\"\")","v":""},null,{"$f":"IF(ROW()<=B$3,INDEX(FP!E:E,B$2+ROW()-1),\"\")","v":""},{"$f":"IF(ROW()<=B$3,INDEX(FP!F:F,B$2+ROW()-1),\"\")","v":""},null,{"$f":"IF(ROW()<=B$3,INDEX(FP!G:G,B$2+ROW()-1),\"\")","v":""},null,{"$f":"IF(ROW()<=B$3,INDEX(FP!C:C,B$2+ROW()-1),\"\")","v":""},"","","",99,"AAA","HHH"]
[{"$f":"IF(ROW()<=B$3,INDEX(FP!F:F,B$2+ROW()-1)&\" - \"&INDEX(FP!C:C,B$2+ROW()-1),\"\")","v":""},null,{"$f":"IF(ROW()<=B$3,INDEX(FP!E:E,B$2+ROW()-1),\"\")","v":""},{"$f":"IF(ROW()<=B$3,INDEX(FP!F:F,B$2+ROW()-1),\"\")","v":""},null,{"$f":"IF(ROW()<=B$3,INDEX(FP!G:G,B$2+ROW()-1),\"\")","v":""},null,{"$f":"IF(ROW()<=B$3,INDEX(FP!C:C,B$2+ROW()-1),\"\")","v":""},"","","",99,{"$f":"$A4","v":""},99]
[{"$f":"IF(ROW()<=B$3,INDEX(FP!F:F,B$2+ROW()-1)&\" - \"&INDEX(FP!C:C,B$2+ROW()-1),\"\")","v":""},null,{"$f":"IF(ROW()<=B$3,INDEX(FP!E:E,B$2+ROW()-1),\"\")","v":""},{"$f":"IF(ROW()<=B$3,INDEX(FP!F:F,B$2+ROW()-1),\"\")","v":""},null,{"$f":"IF(ROW()<=B$3,INDEX(FP!G:G,B$2+ROW()-1),\"\")","v":""},null,{"$f":"IF(ROW()<=B$3,INDEX(FP!C:C,B$2+ROW()-1),\"\")","v":""},"","","",99,"AAA","HHH"]
[{"$f":"IF(ROW()<=B$3,INDEX(FP!F:F,B$2+ROW()-1)&\" - \"&INDEX(FP!C:C,B$2+ROW()-1),\"\")","v":""},null,{"$f":"IF(ROW()<=B$3,INDEX(FP!E:E,B$2+ROW()-1),\"\")","v":""},{"$f":"IF(ROW()<=B$3,INDEX(FP!F:F,B$2+ROW()-1),\"\")","v":""},null,{"$f":"IF(ROW()<=B$3,INDEX(FP!G:G,B$2+ROW()-1),\"\")","v":""},null,{"$f":"IF(ROW()<=B$3,INDEX(FP!C:C,B$2+ROW()-1),\"\")","v":""},"","","",99,{"$f":"$A6","v":""},99]
[{"$f":"IF(ROW()<=B$3,INDEX(FP!F:F,B$2+ROW()-1)&\" - \"&INDEX(FP!C:C,B$2+ROW()-1),\"\")","v":""},null,{"$f":"IF(ROW()<=B$3,INDEX(FP!E:E,B$2+ROW()-1),\"\")","v":""},{"$f":"IF(ROW()<=B$3,INDEX(FP!F:F,B$2+ROW()-1),\"\")","v":""},null,{"$f":"IF(ROW()<=B$3,INDEX(FP!G:G,B$2+ROW()-1),\"\")","v":""},null,{"$f":"IF(ROW()<=B$3,INDEX(FP!C:C,B$2+ROW()-1),\"\")","v":""},"","","",99,"AAA","HHH"]
[{"$f":"IF(ROW()<=B$3,INDEX(FP!F:F,B$2+ROW()-1)&\" - \"&INDEX(FP!C:C,B$2+ROW()-1),\"\")","v":""},null,{"$f":"IF(ROW()<=B$3,INDEX(FP!E:E,B$2+ROW()-1),\"\")","v":""},{"$f":"IF(ROW()<=B$3,INDEX(FP!F:F,B$2+ROW()-1),\"\")","v":""},null,{"$f":"IF(ROW()<=B$3,INDEX(FP!G:G,B$2+ROW()-1),\"\")","v":""},null,{"$f":"IF(ROW()<=B$3,INDEX(FP!C:C,B$2+ROW()-1),\"\")","v":""},"","","",99,{"$f":"$A8","v":""},99]
[{"$f":"IF(ROW()<=B$3,INDEX(FP!F:F,B$2+ROW()-1)&\" - \"&INDEX(FP!C:C,B$2+ROW()-1),\"\")","v":""},null,{"$f":"IF(ROW()<=B$3,INDEX(FP!E:E,B$2+ROW()-1),\"\")","v":""},{"$f":"IF(ROW()<=B$3,INDEX(FP!F:F,B$2+ROW()-1),\"\")","v":""},null,{"$f":"IF(ROW()<=B$3,INDEX(FP!G:G,B$2+ROW()-1),\"\")","v":""},null,{"$f":"IF(ROW()<=B$3,INDEX(FP!C:C,B$2+ROW()-1),\"\")","v":""},"","","",99,"AAA","HHH"]
{"$rows_left_out":148}
{"sheet":"Adr","index":5,"n_rows":111,"n_cols":18,"rows_kept":111,"cut":false,"hidden":true,"merged":[]}
["IČO","Subjekt","Právna forma","Ulica a číslo domu","Mesto","PSČ","Webové sídlo","E-mail","Štatutárny zástupca","Štatutár - funkcia","Kontakná osoba","Kontakt\ntelefón","IBAN 1","IBAN PUŠ 2","IBAN TOP","IBAN DOT"]
["42254388","Deaflympijský výbor Slovenska","občianske združenie","Kýčerského 7","Bratislava 1","811 05","www.deaflympic.sk","office@deaflympic.sk","Peter Birka","prezident","Milena Fabšičová",421911370554,"SK30 1100 0000 0029 2988 5740",null,null,null,null,{"$f":"A2","v":"42254388"}]
["50642804","iCompete Natural Slovakia","občianske združenie","Jesenského 71","Zvolen","960 01","www.icn.sk","icn@icn.sk","René Tomášek","prezident","René Tomášek",421905819613,"SK84 7500 0000 0040 3183 7581"]
["00688312","Klub slovenských turistov","občianske združenie","Záborského 33","Bratislava 3","831 03","www.kst.sk","ustredie@kst.sk","František Šiller","predseda","Marica Žáková",421910448008,"SK34 0900 0000 0001 7152 7595"]
["47845660","Košická Futbalová Aréna a. s.","akciová spoločnosť","Pri prachárni 13","Košice – mestská časť Juh","040 11","www.kosickafutbalovaarena.sk","office@kosickafutbalovaarena.sk","Marcel Gibóda, Stanislav Petráš","predseda predstavenstva, člen predstavenstva",null,null,"SK89 0200 0000 0035 8891 0657"]
["42269423","MAMMAL - Slovenský zväz MMA","občianske združenie","Židovská 298/19","Bratislava 1","811 01","www.mammal.sk","info@mammal.sk; marek.herda@mammal.sk","Marek Herda","prezident","Jana Gurová",421903555547,"SK31 0200 0000 0031 8656 0551"]
["00595209","Maratónsky klub Košice","občianske združenie","Hroncova 2","Košice","040 01","www.kosicemarathon.com","klub@kosicemarathon.com","Ján Sudzina","prezident",null,null,"SK53 0900 0000 0051 8854 0107"]
["42296901","Občianske združenie Street Dance Academy","občianske združenie","Kvačalova 1011/51","Bratislava 2","821 08","www.streetdance.sk","stanka@streetdance.sk","Ladislav Neuschl","predseda","Stanislava Matejová",421911472299,"SK67 0900 0000 0051 8102 0512",null,null,null,null,{"$f":"A8","v":"42296901"}]
["42255171","OZ za zdravší život","občianske združenie","Komárnicka 11","Bratislava 2","821 33","www.zdravachrbtica.sk","info@zdravachrbtica.sk","Róbert Rusnák","predseda","Zuzana Hrčková",421918149068,"SK12 1100 0000 0029 4307 8646"]
["53500423","Pomáhame pohybom","občianske združenie","Prievozská 1326/34","Bratislava 2","821 05","https://www.falcon1crossfit.sk/sk/obcianske-zdruzenie/","pomahamepohybom@gmail.com","Róbert Rybanský","podpredseda","Róbert Rybanský",421917614884,"SK25 1100 0000 0029 4511 8904"]
{"$rows_left_out":102}
{"sheet":"FP","index":6,"n_rows":822,"n_cols":14,"rows_kept":822,"cut":false,"hidden":true,"merged":[]}
["IČO","Prijímateľ","Predmet\n(názov, miesto, termín, parametre)","Schválená\n(eur)","SF\n(%)","Účel","PPG","B/K","ico+ucel","ico+ppg","Šport","ICO+PPG+BK","Zoraď","ico+ucel+B/K"]
["42254388",{"$f":"VLOOKUP(A2,Adr!A:B,2,FALSE)","v":"Deaflympijský výbor Slovenska"},"zabezpečenie činnosti a úloh v roku 2024",310117,0,"c","026 03","B",{"$f":"A2&F2","v":"42254388c"},{"$f":"A2&G2","v":"42254388026 03"},null,{"$f":"A2&G2&H2","v":"42254388026 03B"},{"$f":"B2&F2&H2&C2","v":"Deaflympijský výbor SlovenskacBzabezpečenie činnosti a úloh v roku 2024"},{"$f":"+I2&H2","v":"42254388cB"}]
["30787009",{"$f":"VLOOKUP(A3,Adr!A:B,2,FALSE)","v":"Slovenská asociácia amerického futbalu, o.z."},"americký futbal - bežné transfery",30160,0,"a","026 02","B","30787009a","30787009026 02","americký futbal","30787009026 02B","Slovenská asociácia amerického futbalu, o.z.aBamerický futbal - bežné transfery","30787009aB"]
["00631655",{"$f":"VLOOKUP(A4,Adr!A:B,2,FALSE)","v":"Slovenská asociácia boccie"},"boccia - bežné transfery",30160,0,"a","026 02","B","00631655a","00631655026 02","boccia","00631655026 02B","Slovenská asociácia boccieaBboccia - bežné transfery","00631655aB"]
["00631655",{"$f":"VLOOKUP(A5,Adr!A:B,2,FALSE)","v":"Slovenská asociácia boccie"},"boule lyonnaise - bežné transfery",30160,0,"a","026 02","B","00631655a","00631655026 02","boule lyonnaise","00631655026 02B","Slovenská asociácia boccieaBboule lyonnaise - bežné transfery","00631655aB"]
["42019541",{"$f":"VLOOKUP(A6,Adr!A:B,2,FALSE)","v":"Slovenská asociácia čínskeho wushu"},"wushu - bežné transfery",30160,0,"a","026 02","B","42019541a","42019541026 02","wushu","42019541026 02B","Slovenská asociácia čínskeho wushuaBwushu - bežné transfery","42019541aB"]
["30810108",{"$f":"VLOOKUP(A7,Adr!A:B,2,FALSE)","v":"Slovenská Asociácia Dynamickej Streľby"},"dynamická streľba - bežné transfery",50284,0,"a","026 02","B","30810108a","30810108026 02","dynamická streľba","30810108026 02B","Slovenská Asociácia Dynamickej StreľbyaBdynamická streľba - bežné transfery","30810108aB"]
["30842069",{"$f":"VLOOKUP(A8,Adr!A:B,2,FALSE)","v":"Slovenská asociácia fitnes, kulturistiky a silového trojboja"},"fitnes a kulturistika - bežné transfery",730205,0,"a","026 02","B","30842069a","30842069026 02","fitnes a kulturistika","30842069026 02B","Slovenská asociácia fitnes, kulturistiky a silového trojbojaaBfitnes a kulturistika - bežné transfery","30842069aB"]
["30842069",{"$f":"VLOOKUP(A9,Adr!A:B,2,FALSE)","v":"Slovenská asociácia fitnes, kulturistiky a silového trojboja"},"silové športy - bežné transfery",41829,0,"a","026 02","B","30842069a","30842069026 02","silové športy","30842069026 02B","Slovenská asociácia fitnes, kulturistiky a silového trojbojaaBsilové športy - bežné transfery","30842069aB"]
["31749852",{"$f":"VLOOKUP(A10,Adr!A:B,2,FALSE)","v":"Slovenská asociácia Frisbee"},"športy s lietajúcim diskom - bežné transfery",118069,0,"a","026 02","B","31749852a","31749852026 02","športy s lietajúcim diskom","31749852026 02B","Slovenská asociácia FrisbeeaBšporty s lietajúcim diskom - bežné transfery","31749852aB"]
{"$rows_left_out":813}
{"sheet":"Cis","index":7,"n_rows":98,"n_cols":10,"rows_kept":98,"cut":false,"hidden":true,"merged":[]}
["Šport",null,"Účel","Účel rozšírený","Režim","PPG","Transfer",null,"PPG","PPG názov"]
["aikido",null,"a","šport 23 ",1,"026 02","Príspevok uznanému športu",null,"026 01","Šport pre všetkých, školský a univerzitný  šport"]
["americký futbal",null,"b","talenty",1,"026 02","Príspevok uznanému športu",null,"026 02","Uznané športy"]
["atletika",null,"c","reprezentácia",1,"026 02","Príspevok uznanému športu",null,"026 03","Národné športové projekty"]
["automobilový šport",null,"d","administratíva",1,"026 02","Príspevok uznanému športu",null,"026 04","Športová infraštruktúra"]
["bandy hokej",null,"e","ostatné",1,"026 02","Príspevok uznanému športu",null,"026 05","Prierezové činnosti"]
["basebal",null,"f","športovci",2,"026 03","Príspevok šporovcom top tímu"]
["basketbal",null,"g","SOV",3,"026 03","Príspevok Slovenskému olympijskému výboru"]
["baskická pelota",null,"h","SPV",3,"026 03","Príspevok slovenskému paralympijskému výboru"]
["bedminton",null,"i","účasť a mládež",4,"026 03","Dotácia"]
{"$rows_left_out":89}
{"sheet":"Avízo - výnosy","index":8,"n_rows":30,"n_cols":16,"rows_kept":30,"cut":false,"hidden":false,"merged":[[21,1,21,2],[0,0,0,2],[2,4,3,5],[11,0,11,2],[13,0,13,2],[14,1,14,2]]}
[{"$f":"Spolu!C3&\", \"&Spolu!C6","v":"Slovenský krasokorčuliarsky zväz, Záhradnícka 752/95, Bratislava, 821 08"},null,null,null,null,null,null,null,null,null,null,null,null,{"$f":"O1&\" - \"&P1","v":"a - príspevok uznaným športom"},"a","príspevok uznaným športom"]
[null,null,null,null,null,null,null,null,null,null,null,null,null,{"$f":"O2&\" - \"&P2","v":"b - príspevok Slovenskému olympijskému a športovému výboru"},"b","príspevok Slovenskému olympijskému a športovému výboru"]
[null,null,null,null,"1. VYPLŇTE ZELENÉ BUNKY\n2. VYTLAČTE, PODPÍŠTE A ODOŠLITE V LISTINNEJ PODOBE",null,null,null,null,null,null,null,null,"c - príspevok Slovenskému paralympijskému výboru","c","príspevok Slovenskému paralympijskému výboru"]
[null,null,null,null,null,null,null,null,null,null,null,null,null,"d - príspevok športovcom top tímu","d","príspevok športovcom top tímu"]
[null,null,"Ministerstvo školstva, vedy, výskumu a športu Slovenskej republiky",null,null,null,null,null,null,null,null,null,null,"e - rozvoj športov, ktoré nie sú uznanými podľa zákona č. 440/2015 Z. z.","e","rozvoj športov, ktoré nie sú uznanými podľa zákona č. 440/2015 Z. z."]
[null,null,"sekcia športu ",null,"Dátum poukázania vrátených prostriedkov:",null,null,null,null,null,null,null,null,"f - organizovanie významných a tradičných športových podujatí na území SR v roku 2020","f","organizovanie významných a tradičných športových podujatí na území SR v roku 2020"]
[null,null,"Stromová 1",null,"Suma vrátených prostriedkov (eur):",null,null,null,null,null,null,null,null,"g - projekty školského, univerzitného športu a športu pre všetkých","g","projekty školského, univerzitného športu a športu pre všetkých"]
[null,null,"813 30  Bratislava 1",null,"IBAN odosielajúceho účtu:",null,null,null,null,null,null,null,null,"h - podpora a rozvoj turistických a cykloturistických trás","h","podpora a rozvoj turistických a cykloturistických trás"]
[null,null,null,null,"Dátum odoslania AVÍZA:",null,null,null,null,null,null,null,null,"i - finančné odmeny športovcom za výsledky dosiahnuté v roku 2019 a trénerom mládeže za dosiahnuté výsledky ich športovcov v roku 2019 a za celoživotnú prácu s mládežou","i","finančné odmeny športovcom za výsledky dosiahnuté v roku 2019 a trénerom mládeže za dosiahnuté výsledky ich športovcov v roku 2019 a za celoživotnú prácu s mládežou"]
[null,null,null,null,null,null,null,null,null,null,null,null,null,"j - projekty pre popularizáciu pohybových aktivít detí, mládeže a seniorov","j","projekty pre popularizáciu pohybových aktivít detí, mládeže a seniorov"]
{"$rows_left_out":21}
{"sheet":"Avízo - vratka","index":9,"n_rows":30,"n_cols":16,"rows_kept":30,"cut":false,"hidden":false,"merged":[[23,1,23,2],[2,4,3,5],[0,0,0,2],[14,1,14,2],[13,1,13,2],[11,0,11,2],[12,0,12,2],[14,5,16,5]]}
[{"$f":"Spolu!C3&\", \"&Spolu!C6","v":"Slovenský krasokorčuliarsky zväz, Záhradnícka 752/95, Bratislava, 821 08"},null,null,null,null,null,null,null,null,null,null,null,null,{"$f":"O1&\" - \"&P1","v":"a - príspevok uznaným športom"},"a","príspevok uznaným športom"]
[null,null,null,null,null,null,null,null,null,null,null,null,null,{"$f":"O2&\" - \"&P2","v":"b - príspevok Slovenskému olympijskému a športovému výboru"},"b","príspevok Slovenskému olympijskému a športovému výboru"]
[null,null,null,null,"1. VYPLŇTE ZELENÉ BUNKY\n2. VYTLAČTE, PODPÍŠTE A ODOŠLITE V LISTINNEJ PODOBE",null,null,null,null,null,null,null,null,"c - príspevok Slovenskému paralympijskému výboru","c","príspevok Slovenskému paralympijskému výboru"]
[null,null,null,null,null,null,null,null,null,null,null,null,null,"d - príspevok športovcom top tímu","d","príspevok športovcom top tímu"]
[null,null,"Ministerstvo školstva, vedy, výskumu a športu Slovenskej republiky",null,null,null,null,null,null,null,null,null,null,"e - rozvoj športov, ktoré nie sú uznanými podľa zákona č. 440/2015 Z. z.","e","rozvoj športov, ktoré nie sú uznanými podľa zákona č. 440/2015 Z. z."]
[null,null,"sekcia športu ",null,"Dátum poukázania vrátených prostriedkov:",null,null,null,null,null,null,null,null,"f - organizovanie významných a tradičných športových podujatí na území SR v roku 2020","f","organizovanie významných a tradičných športových podujatí na území SR v roku 2020"]
[null,null,"Stromová 1",null,"Suma vrátených prostriedkov (eur):",null,null,null,null,null,null,null,null,"g - projekty školského, univerzitného športu a športu pre všetkých","g","projekty školského, univerzitného športu a športu pre všetkých"]
[null,null,"813 30  Bratislava 1",null,"IBAN odosielajúceho účtu:",null,null,null,null,null,null,null,null,"h - podpora a rozvoj turistických a cykloturistických trás","h","podpora a rozvoj turistických a cykloturistických trás"]
[null,null,null,null,"IBAN určeného účtu ministerstva:",null,null,null,null,null,null,null,null,"i - finančné odmeny športovcom za výsledky dosiahnuté v roku 2019 a trénerom mládeže za dosiahnuté výsledky ich športovcov v roku 2019 a za celoživotnú prácu s mládežou","i","finančné odmeny športovcom za výsledky dosiahnuté v roku 2019 a trénerom mládeže za dosiahnuté výsledky ich športovcov v roku 2019 a za celoživotnú prácu s mládežou"]
[null,null,null,null,"Dátum odoslania AVÍZA:",null,null,null,null,null,null,null,null,"j - projekty pre popularizáciu pohybových aktivít detí, mládeže a seniorov","j","projekty pre popularizáciu pohybových aktivít detí, mládeže a seniorov"]
{"$rows_left_out":21}
{"sheet":"Skratky","index":10,"n_rows":21,"n_cols":2,"rows_kept":21,"cut":false,"hidden":false,"merged":[[1,0,1,1]]}
["Zoznam akceptovaných skratiek"]
["Pri vyúčtovaní môžete používať nasledovné skratky. Ak potrebujete, definujte ďalšie."]
["Skratka","Vysvetlenie"]
["MS","majstrovstvá sveta"]
["ME","majstrovstvá Európy"]
["SP","svetový pohár"]
["EP","európsky pohár"]
["MSR","majstrovstvá Slovenska"]
["VV","výkonný výbor"]
["ŠH","športová hala"]
{"$rows_left_out":11}